Project

General

Profile

Bug #3120 » build-1638890678.log

build job - gzpapp@gmail.com, 2021-12-07 17:44

 
[1/195] Compiling C object src/test_mod.p/algo_md5.c.o
[2/195] Compiling C object src/test_common.p/t_test_common.c.o
[3/195] Compiling C object src/test_mod.p/t_test_mod.c.o
[4/195] Compiling C object src/lighttpd-angel.p/lighttpd-angel.c.o
[5/195] Linking target src/lighttpd-angel
[6/195] Compiling C object src/test_configfile.p/t_test_configfile.c.o
[7/195] Compiling C object src/test_common.p/t_test_base64.c.o
[8/195] Compiling C object src/test_common.p/t_test_array.c.o
[9/195] Compiling C object src/test_configfile.p/buffer.c.o
[10/195] Compiling C object src/test_common.p/t_test_keyvalue.c.o
[11/195] Compiling C object src/test_common.p/http_kv.c.o
[12/195] Compiling C object src/test_common.p/fdlog.c.o
[13/195] Compiling C object src/test_common.p/http_header.c.o
[14/195] Compiling C object src/test_common.p/t_test_buffer.c.o
[15/195] Compiling C object src/test_common.p/ck.c.o
[16/195] Compiling C object src/test_common.p/log.c.o
[17/195] Compiling C object src/test_configfile.p/http_kv.c.o
[18/195] Compiling C object src/test_common.p/sock_addr.c.o
[19/195] Compiling C object src/test_configfile.p/data_config.c.o
[20/195] Compiling C object src/test_common.p/t_test_burl.c.o
[21/195] Compiling C object src/test_configfile.p/vector.c.o
[22/195] Compiling C object src/test_common.p/t_test_request.c.o
[23/195] Compiling C object src/test_mod.p/algo_sha1.c.o
[24/195] Compiling C object src/test_configfile.p/ck.c.o
[25/195] Compiling C object src/test_configfile.p/http_header.c.o
[26/195] Compiling C object src/test_configfile.p/fdlog.c.o
[27/195] Compiling C object src/test_configfile.p/log.c.o
[28/195] Compiling C object src/test_configfile.p/array.c.o
[29/195] Compiling C object src/test_configfile.p/sock_addr.c.o
[30/195] Compiling C object src/test_mod.p/algo_splaytree.c.o
[31/195] Linking target src/test_common
FAILED: src/test_common
/pkg/bin/gcc -o src/test_common src/test_common.p/t_test_common.c.o src/test_common.p/t_test_array.c.o src/test_common.p/t_test_base64.c.o src/test_common.p/t_test_buffer.c.o src/test_common.p/t_test_burl.c.o src/test_common.p/t_test_keyvalue.c.o src/test_common.p/t_test_request.c.o src/test_common.p/http_header.c.o src/test_common.p/http_kv.c.o src/test_common.p/log.c.o src/test_common.p/fdlog.c.o src/test_common.p/sock_addr.c.o src/test_common.p/ck.c.o -L/pkg/lib -I/pkg/include -Wl,--as-needed -Wl,--no-undefined -Wl,-O1 -Wl,-R/pkg/lib -Wl,--start-group /pkg/lib/libpcre2-8.so -Wl,--end-group
/pkg/bin/ld: src/test_common.p/log.c.o: in function `log_buffer_timestamp':
/home/gzp/build.pkg/lighttpd/build/1.4.63/../../src/1.4.63/src/log.c:104: undefined reference to `clock_gettime'
collect2: error: ld returned 1 exit status
[32/195] Compiling C object src/test_mod.p/base64.c.o
[33/195] Linking target src/test_configfile
FAILED: src/test_configfile
/pkg/bin/gcc -o src/test_configfile src/test_configfile.p/t_test_configfile.c.o src/test_configfile.p/buffer.c.o src/test_configfile.p/array.c.o src/test_configfile.p/data_config.c.o src/test_configfile.p/http_header.c.o src/test_configfile.p/http_kv.c.o src/test_configfile.p/vector.c.o src/test_configfile.p/log.c.o src/test_configfile.p/fdlog.c.o src/test_configfile.p/sock_addr.c.o src/test_configfile.p/ck.c.o -L/pkg/lib -I/pkg/include -Wl,--as-needed -Wl,--no-undefined -Wl,-O1 -Wl,-R/pkg/lib -Wl,--start-group /pkg/lib/libpcre2-8.so -Wl,--end-group
/pkg/bin/ld: src/test_configfile.p/log.c.o: in function `log_buffer_timestamp':
/home/gzp/build.pkg/lighttpd/build/1.4.63/../../src/1.4.63/src/log.c:104: undefined reference to `clock_gettime'
collect2: error: ld returned 1 exit status
[34/195] Compiling C object src/test_mod.p/http_etag.c.o
[35/195] Compiling C object src/test_mod.p/burl.c.o
[36/195] Compiling C object src/test_mod.p/array.c.o
[37/195] Compiling C object src/test_mod.p/configfile-glue.c.o
[38/195] Compiling C object src/test_mod.p/buffer.c.o
[39/195] Compiling C object src/lemon.p/lemon.c.o
[40/195] Compiling C object src/test_mod.p/chunk.c.o
ninja: build stopped: subcommand failed.
(2-2/3)